BDBM83244 MLS001180408::N-[(E)-1-[3-(dimethylamino)propylcarbamoyl]-2-[5-(4-nitrophenyl)-2-furyl]vinyl]-4-methyl-benzamide::N-[(E)-3-[3-(dimethylamino)propylamino]-1-[5-(4-nitrophenyl)-2-furanyl]-3-oxoprop-1-en-2-yl]-4-methylbenzamide::N-[(E)-3-[3-(dimethylamino)propylamino]-1-[5-(4-nitrophenyl)furan-2-yl]-3-oxidanylidene-prop-1-en-2-yl]-4-methyl-benzamide::N-[(E)-3-[3-(dimethylamino)propylamino]-1-[5-(4-nitrophenyl)furan-2-yl]-3-oxoprop-1-en-2-yl]-4-methylbenzamide::N-[1-({[3-(dimethylamino)propyl]amino}carbonyl)-2-(5-{4-nitrophenyl}-2-furyl)vinyl]-4-methylbenzamide::SMR000475967::acs.jmedchem.1c00409_ST.507::cid_1719488
SMILES CN(C)CCCNC(=O)C(\NC(=O)c1ccc(C)cc1)=C/c1ccc(o1)-c1ccc(cc1)[N+]([O-])=O
InChI Key InChIKey=DAFPTHXWZCKQGM-HAVVHWLPSA-N
Data  3 IC50
  Tab Delimited (TSV)   2D SDfile   Computed 3D by Vconf -m prep SDfile
Find this compound or compounds like it in BindingDB:
Activity Spreadsheet -- Enzyme Inhibition Constant Data from BindingDB
Found 3 hits for monomerid = 83244
TargetToll-like receptor 9(Homo sapiens (Human))
The Scripps Research Institute Molecular Screening Center
Curated by PubChem BioAssay
LigandPNGBDBM83244(MLS001180408 | N-[(E)-1-[3-(dimethylamino)propylca...)
Affinity DataIC50:  4.13E+3nM. Assay description: Source (MLPCN Center Name): The Scripps Research Institute Molecular Screening Center (SRIMSC) Affiliation: The Scripps Research Institute, TSRI Assa...
In DepthDetails PCBioAssay
TargetReplicase polyprotein 1ab(Human SARS coronavirus (SARS-CoV) (Severe acute re...)
Michigan State University
LigandPNGBDBM83244(MLS001180408 | N-[(E)-1-[3-(dimethylamino)propylca...)
Affinity DataIC50:  1.00E+4nM. Assay description: This is a review article. Please point to the original journal.
In DepthDetails ArticlePubMed
TargetBeta-lactamase(Pseudomonas aeruginosa)
The Scripps Research Institute Molecular Screening Center
Curated by PubChem BioAssay
LigandPNGBDBM83244(MLS001180408 | N-[(E)-1-[3-(dimethylamino)propylca...)
Affinity DataIC50:  6.55E+3nM. Assay description: Source (MLPCN Center Name): The Scripps Research Institute Molecular Screening Center (SRIMSC) Affiliation: The Scripps Research Institute, TSRI Assa...
In DepthDetails PCBioAssay