BDBM83389 4-[5-carbomethoxy-2-keto-4-methyl-6-[2-(2-nitrophenyl)sulfonyloxyphenyl]-1,6-dihydropyrimidin-3-yl]butyric acid::4-[5-methoxycarbonyl-4-methyl-6-[2-(2-nitrophenyl)sulfonyloxyphenyl]-2-oxidanylidene-1,6-dihydropyrimidin-3-yl]butanoic acid::4-[5-methoxycarbonyl-4-methyl-6-[2-(2-nitrophenyl)sulfonyloxyphenyl]-2-oxo-1,6-dihydropyrimidin-3-yl]butanoic acid::MLS000562971::SMR000388992::cid_5461577
SMILES COC(=O)C1=C(C)N(CCCC(O)=O)C(=O)NC1c1ccccc1OS(=O)(=O)c1ccccc1[N+]([O-])=O
InChI Key InChIKey=RLEBFVHVTLQPHV-UHFFFAOYSA-N
Data  1 EC50
  Tab Delimited (TSV)   2D SDfile   Computed 3D by Vconf -m prep SDfile
Find this compound or compounds like it in BindingDB:
Activity Spreadsheet -- Enzyme Inhibition Constant Data from BindingDB
Found 1 hit for monomerid = 83389
TargetDelta-type opioid receptor(Homo sapiens (Human))
The Scripps Research Institute Molecular Screening Center
Curated by PubChem BioAssay
LigandPNGBDBM83389(4-[5-carbomethoxy-2-keto-4-methyl-6-[2-(2-nitrophe...)
Affinity DataEC50:  1.55E+4nM. Assay description: Source (MLPCN Center Name): The Scripps Research Institute Molecular Screening Center (SRIMSC) Affiliation: The Scripps Research Institute, TSRI Assa...
In DepthDetails PCBioAssay