BDBM83403 MLS001172165::N-[2-(dimethylamino)-2-(4-methoxyphenyl)ethyl]-2-(2-methylphenyl)sulfanyl-ethanamide::N-[2-(dimethylamino)-2-(4-methoxyphenyl)ethyl]-2-(2-methylphenyl)sulfanylacetamide::N-[2-(dimethylamino)-2-(4-methoxyphenyl)ethyl]-2-(o-tolylthio)acetamide::N-[2-(dimethylamino)-2-(4-methoxyphenyl)ethyl]-2-[(2-methylphenyl)thio]acetamide::SMR000591785::cid_4883447
SMILES COc1ccc(cc1)C(CNC(=O)CSc1ccccc1C)N(C)C
InChI Key InChIKey=LZTIBBXIOUQBGU-UHFFFAOYSA-N
Data  1 EC50
  Tab Delimited (TSV)   2D SDfile   Computed 3D by Vconf -m prep SDfile
Find this compound or compounds like it in BindingDB:
Activity Spreadsheet -- Enzyme Inhibition Constant Data from BindingDB
Found 1 hit for monomerid = 83403
TargetDelta-type opioid receptor(Homo sapiens (Human))
The Scripps Research Institute Molecular Screening Center
Curated by PubChem BioAssay
LigandPNGBDBM83403(MLS001172165 | N-[2-(dimethylamino)-2-(4-methoxyph...)
Affinity DataEC50: >9.25E+4nM. Assay description: Source (MLPCN Center Name): The Scripps Research Institute Molecular Screening Center (SRIMSC) Affiliation: The Scripps Research Institute, TSRI Assa...
In DepthDetails PCBioAssay