BDBM83491 (6E)-4-chloranyl-6-[4-(furan-2-yl)-1,3-dihydro-1,5-benzodiazepin-2-ylidene]cyclohexa-2,4-dien-1-one::(6E)-4-chloro-6-[4-(2-furanyl)-1,3-dihydro-1,5-benzodiazepin-2-ylidene]-1-cyclohexa-2,4-dienone::(6E)-4-chloro-6-[4-(2-furyl)-1,3-dihydro-1,5-benzodiazepin-2-ylidene]cyclohexa-2,4-dien-1-one::(6E)-4-chloro-6-[4-(furan-2-yl)-1,3-dihydro-1,5-benzodiazepin-2-ylidene]cyclohexa-2,4-dien-1-one::4-Chloro-2-(4-furan-2-yl-3H-benzo[b][1,4]diazepin-2-yl)-phenol::MLS000123463::SMR000124045::cid_9549438
SMILES Oc1ccc(Cl)cc1C1=Nc2ccccc2N=C(C1)c1ccco1
InChI Key InChIKey=UAGSMTAAGNIFCT-UHFFFAOYSA-N
Data  2 IC50  2 EC50
  Tab Delimited (TSV)   2D SDfile   Computed 3D by Vconf -m prep SDfile
Find this compound or compounds like it in BindingDB:
Activity Spreadsheet -- Enzyme Inhibition Constant Data from BindingDB
Found 4 hits for monomerid = 83491
TargetEndoribonuclease toxin MazF(Escherichia coli str. K-12 substr. MG1655)
Burnham Center For Chemical Genomics
Curated by PubChem BioAssay
LigandPNGBDBM83491((6E)-4-chloranyl-6-[4-(furan-2-yl)-1,3-dihydro-1,5...)
Affinity DataEC50: >9.90E+4nM. Assay description: Data Source: Sanford-Burnham Center for Chemical Genomics (SBCCG) Source Affiliation: Sanford-Burnham Medical Research Institute (SBMRI, San Diego, C...
In DepthDetails PCBioAssay
TargetSentrin-specific protease 1(Homo sapiens (Human))
Burnham Center For Chemical Genomics
Curated by PubChem BioAssay
LigandPNGBDBM83491((6E)-4-chloranyl-6-[4-(furan-2-yl)-1,3-dihydro-1,5...)
Affinity DataIC50:  8.37E+3nM
In DepthDetails PCBioAssay
TargetSentrin-specific protease 1(Homo sapiens (Human))
Burnham Center For Chemical Genomics
Curated by PubChem BioAssay
LigandPNGBDBM83491((6E)-4-chloranyl-6-[4-(furan-2-yl)-1,3-dihydro-1,5...)
Affinity DataIC50:  8.31E+3nM
In DepthDetails PCBioAssay
TargetEndoribonuclease toxin MazF(Escherichia coli str. K-12 substr. MG1655)
Burnham Center For Chemical Genomics
Curated by PubChem BioAssay
LigandPNGBDBM83491((6E)-4-chloranyl-6-[4-(furan-2-yl)-1,3-dihydro-1,5...)
Affinity DataEC50: >9.90E+4nM. Assay description: Data Source: Sanford-Burnham Center for Chemical Genomics (SBCCG) Source Affiliation: Sanford-Burnham Medical Research Institute (SBMRI, San Diego, C...
In DepthDetails PCBioAssay