BDBM83602 (2Z)-1-keto-3-methyl-2-(o-anisidinomethylene)pyrido[1,2-a]benzimidazole-4-carbonitrile::(2Z)-2-[(2-methoxyanilino)methylidene]-3-methyl-1-oxo-4-pyrido[1,2-a]benzimidazolecarbonitrile::(2Z)-2-[(2-methoxyanilino)methylidene]-3-methyl-1-oxopyrido[1,2-a]benzimidazole-4-carbonitrile::(2Z)-2-[[(2-methoxyphenyl)amino]methylidene]-3-methyl-1-oxidanylidene-pyrido[1,2-a]benzimidazole-4-carbonitrile::MLS000715161::SMR000275140::cid_5769126
SMILES COc1ccccc1N=Cc1c(C)c(C#N)c2[nH]c3ccccc3n2c1=O
InChI Key InChIKey=VJXBMLCXLZOQEV-FSJBWODESA-N
Data  2 EC50
  Tab Delimited (TSV)   2D SDfile   Computed 3D by Vconf -m prep SDfile
Find this compound or compounds like it in BindingDB:
Activity Spreadsheet -- Enzyme Inhibition Constant Data from BindingDB
Found 2 hits for monomerid = 83602
TargetEndoribonuclease toxin MazF(Escherichia coli str. K-12 substr. MG1655)
Burnham Center For Chemical Genomics
Curated by PubChem BioAssay
LigandPNGBDBM83602((2Z)-1-keto-3-methyl-2-(o-anisidinomethylene)pyrid...)
Affinity DataEC50: >9.90E+4nM. Assay description: Data Source: Sanford-Burnham Center for Chemical Genomics (SBCCG) Source Affiliation: Sanford-Burnham Medical Research Institute (SBMRI, San Diego, C...
In DepthDetails PCBioAssay
TargetEndoribonuclease toxin MazF(Escherichia coli str. K-12 substr. MG1655)
Burnham Center For Chemical Genomics
Curated by PubChem BioAssay
LigandPNGBDBM83602((2Z)-1-keto-3-methyl-2-(o-anisidinomethylene)pyrid...)
Affinity DataEC50: >9.90E+4nM. Assay description: Data Source: Sanford-Burnham Center for Chemical Genomics (SBCCG) Source Affiliation: Sanford-Burnham Medical Research Institute (SBMRI, San Diego, C...
In DepthDetails PCBioAssay