BDBM83614 MLS001032916::SMR000363438::[2-cyano-2-[3-(3-ethyl-1-pyridin-1-iumyl)-2-quinoxalinyl]ethenylidene]azanide::[2-cyano-2-[3-(3-ethylpyridin-1-ium-1-yl)quinoxalin-2-yl]ethenylidene]azanide::cid_2312618
SMILES CCc1ccc[n+](c1)-c1nc2ccccc2nc1[C-](C#N)C#N
InChI Key InChIKey=HPIMVFJNGYEPTK-UHFFFAOYSA-N
Data  2 EC50
  Tab Delimited (TSV)   2D SDfile   Computed 3D by Vconf -m prep SDfile
Find this compound or compounds like it in BindingDB:
Activity Spreadsheet -- Enzyme Inhibition Constant Data from BindingDB
Found 2 hits for monomerid = 83614
TargetEndoribonuclease toxin MazF(Escherichia coli str. K-12 substr. MG1655)
Burnham Center For Chemical Genomics
Curated by PubChem BioAssay
LigandPNGBDBM83614(MLS001032916 | SMR000363438 | [2-cyano-2-[3-(3-eth...)
Affinity DataEC50:  5.92E+4nM. Assay description: Data Source: Sanford-Burnham Center for Chemical Genomics (SBCCG) Source Affiliation: Sanford-Burnham Medical Research Institute (SBMRI, San Diego, C...
In DepthDetails PCBioAssay
TargetEndoribonuclease toxin MazF(Escherichia coli str. K-12 substr. MG1655)
Burnham Center For Chemical Genomics
Curated by PubChem BioAssay
LigandPNGBDBM83614(MLS001032916 | SMR000363438 | [2-cyano-2-[3-(3-eth...)
Affinity DataEC50: >9.90E+4nM. Assay description: Data Source: Sanford-Burnham Center for Chemical Genomics (SBCCG) Source Affiliation: Sanford-Burnham Medical Research Institute (SBMRI, San Diego, C...
In DepthDetails PCBioAssay