BDBM83701 (Z)-2-cyano-N-(2-fluorophenyl)-3-[(3E)-2-(4-morpholinyl)-3-[(3-nitrophenyl)methylidene]-1-cyclopentenyl]-2-propenamide::(Z)-2-cyano-N-(2-fluorophenyl)-3-[(3E)-2-morpholin-4-yl-3-[(3-nitrophenyl)methylidene]cyclopenten-1-yl]prop-2-enamide::(Z)-2-cyano-N-(2-fluorophenyl)-3-[(3E)-2-morpholino-3-(3-nitrobenzylidene)cyclopenten-1-yl]acrylamide::MLS002635909::SMR001544559::cid_2338341
SMILES [O-][N+](=O)c1cccc(\C=C2/CCC(\C=C(\C#N)C(=O)Nc3ccccc3F)=C2N2CCOCC2)c1
InChI Key InChIKey=UZIJVCHJJSDCHH-XPIFUUQGSA-N
Data  2 EC50
  Tab Delimited (TSV)   2D SDfile   Computed 3D by Vconf -m prep SDfile
Find this compound or compounds like it in BindingDB:
Activity Spreadsheet -- Enzyme Inhibition Constant Data from BindingDB
Found 2 hits for monomerid = 83701
TargetEndoribonuclease toxin MazF(Escherichia coli str. K-12 substr. MG1655)
Burnham Center For Chemical Genomics
Curated by PubChem BioAssay
LigandPNGBDBM83701((Z)-2-cyano-N-(2-fluorophenyl)-3-[(3E)-2-(4-morpho...)
Affinity DataEC50: >9.90E+4nM. Assay description: Data Source: Sanford-Burnham Center for Chemical Genomics (SBCCG) Source Affiliation: Sanford-Burnham Medical Research Institute (SBMRI, San Diego, C...
In DepthDetails PCBioAssay
TargetEndoribonuclease toxin MazF(Escherichia coli str. K-12 substr. MG1655)
Burnham Center For Chemical Genomics
Curated by PubChem BioAssay
LigandPNGBDBM83701((Z)-2-cyano-N-(2-fluorophenyl)-3-[(3E)-2-(4-morpho...)
Affinity DataEC50: >9.90E+4nM. Assay description: Data Source: Sanford-Burnham Center for Chemical Genomics (SBCCG) Source Affiliation: Sanford-Burnham Medical Research Institute (SBMRI, San Diego, C...
In DepthDetails PCBioAssay