BDBM83750 2-[(3-allyl-4-keto-5-phenyl-thieno[2,3-d]pyrimidin-2-yl)thio]-N-piperonyl-propionamide::MLS000565809::N-(1,3-benzodioxol-5-ylmethyl)-2-(4-oxidanylidene-5-phenyl-3-prop-2-enyl-thieno[2,3-d]pyrimidin-2-yl)sulfanyl-propanamide::N-(1,3-benzodioxol-5-ylmethyl)-2-(4-oxo-5-phenyl-3-prop-2-enylthieno[2,3-d]pyrimidin-2-yl)sulfanylpropanamide::N-(1,3-benzodioxol-5-ylmethyl)-2-[(4-oxo-5-phenyl-3-prop-2-enyl-2-thieno[2,3-d]pyrimidinyl)thio]propanamide::SMR000152895::cid_4553929
SMILES CC(Sc1nc2scc(-c3ccccc3)c2c(=O)n1CC=C)C(=O)NCc1ccc2OCOc2c1
InChI Key InChIKey=SQHZDLDRIMPJDR-UHFFFAOYSA-N
Data  1 EC50
  Tab Delimited (TSV)   2D SDfile   Computed 3D by Vconf -m prep SDfile
Find this compound or compounds like it in BindingDB:
Activity Spreadsheet -- Enzyme Inhibition Constant Data from BindingDB
Found 1 hit for monomerid = 83750
TargetOrotidine 5'-phosphate decarboxylase(Aspergillus niger)
The Scripps Research Institute Molecular Screening Center
Curated by PubChem BioAssay
LigandPNGBDBM83750(2-[(3-allyl-4-keto-5-phenyl-thieno[2,3-d]pyrimidin...)
Affinity DataEC50: >5.97E+4nM. Assay description: Source (MLPCN Center Name): The Scripps Research Institute Molecular Screening Center (SRISMC) Center Affiliation: The Scripps Research Institute, TS...
In DepthDetails PCBioAssay