BDBM83794 MLS000516284::N-[(6-amino-1-benzyl-2,4-diketo-pyrimidin-5-yl)-(3-methoxypropyl)thiocarbamoyl]adamantane-1-carboxamide::N-[(6-amino-1-benzyl-2,4-dioxopyrimidin-5-yl)-(3-methoxypropyl)carbamothioyl]adamantane-1-carboxamide::N-[[6-azanyl-2,4-bis(oxidanylidene)-1-(phenylmethyl)pyrimidin-5-yl]-(3-methoxypropyl)carbamothioyl]adamantane-1-carboxamide::N-[[[6-amino-2,4-dioxo-1-(phenylmethyl)-5-pyrimidinyl]-(3-methoxypropyl)amino]-sulfanylidenemethyl]-1-adamantanecarboxamide::SMR000372898::cid_5039925
SMILES [H]C12CC3([H])CC([H])(C1)CC(C2)(C3)C(=O)NC(=S)N(CCCOC)c1c(N)n(Cc2ccccc2)c(=O)[nH]c1=O
InChI Key InChIKey=ZNDZLJCDRNCJJC-UHFFFAOYSA-N
Data  1 EC50
  Tab Delimited (TSV)   2D SDfile   Computed 3D by Vconf -m prep SDfile
Find this compound or compounds like it in BindingDB:
Activity Spreadsheet -- Enzyme Inhibition Constant Data from BindingDB
Found 1 hit for monomerid = 83794
TargetOrotidine 5'-phosphate decarboxylase(Aspergillus niger)
The Scripps Research Institute Molecular Screening Center
Curated by PubChem BioAssay
LigandPNGBDBM83794(MLS000516284 | N-[(6-amino-1-benzyl-2,4-diketo-pyr...)
Affinity DataEC50: >5.97E+4nM. Assay description: Source (MLPCN Center Name): The Scripps Research Institute Molecular Screening Center (SRISMC) Center Affiliation: The Scripps Research Institute, TS...
In DepthDetails PCBioAssay