BDBM83950 2-chloranyl-3-(2-morpholin-4-ylethylamino)naphthalene-1,4-dione::2-chloro-3-(2-morpholin-4-ylethylamino)naphthalene-1,4-dione::2-chloro-3-(2-morpholinoethylamino)-1,4-naphthoquinone::2-chloro-3-[(2-morpholinoethyl)amino]naphthoquinone::2-chloro-3-[2-(4-morpholinyl)ethylamino]naphthalene-1,4-dione::MLS001195486::SMR000550708::cid_312589
SMILES Oc1c(Cl)c(N=CCN2CCOCC2)c(O)c2ccccc12
InChI Key InChIKey=OMSLPKDYBIFPJY-UHFFFAOYSA-N
Data  3 IC50
  Tab Delimited (TSV)   2D SDfile   Computed 3D by Vconf -m prep SDfile
Find this compound or compounds like it in BindingDB:
Activity Spreadsheet -- Enzyme Inhibition Constant Data from BindingDB
Found 3 hits for monomerid = 83950
TargetCaspase-9(Homo sapiens (Human))
Burnham Center For Chemical Genomics
Curated by PubChem BioAssay
LigandPNGBDBM83950(2-chloranyl-3-(2-morpholin-4-ylethylamino)naphthal...)
Affinity DataIC50:  2.33E+4nM. Assay description: Data Source: Sanford-Burnham Center for Chemical Genomics (SBCCG) Source Affiliation: Sanford-Burnham Medical Research Institute (SBIMR, San Diego, C...
In DepthDetails PCBioAssay
TargetApoptotic protease-activating factor 1(Homo sapiens (Human))
Burnham Center For Chemical Genomics
Curated by PubChem BioAssay
LigandPNGBDBM83950(2-chloranyl-3-(2-morpholin-4-ylethylamino)naphthal...)
Affinity DataIC50: >1.00E+5nM. Assay description: Data Source: Sanford-Burnham Center for Chemical Genomics (SBCCG) Source Affiliation: Sanford-Burnham Medical Research Institute (SBIMR, San Diego, C...
In DepthDetails PCBioAssay
TargetApoptotic protease-activating factor 1(Homo sapiens (Human))
Burnham Center For Chemical Genomics
Curated by PubChem BioAssay
LigandPNGBDBM83950(2-chloranyl-3-(2-morpholin-4-ylethylamino)naphthal...)
Affinity DataIC50:  2.20E+4nM. Assay description: Data Source: Sanford-Burnham Center for Chemical Genomics (SBCCG) Source Affiliation: Sanford-Burnham Medical Research Institute (SBIMR, San Diego, C...
In DepthDetails PCBioAssay