BDBM84058 MLS-0454612.0002::N'-[(Z)-3-indolylidenemethyl]-1-(4-methoxyphenyl)-5-oxo-3-pyrrolidinecarbohydrazide::N'-[(Z)-indol-3-ylidenemethyl]-1-(4-methoxyphenyl)-5-oxidanylidene-pyrrolidine-3-carbohydrazide::N'-[(Z)-indol-3-ylidenemethyl]-1-(4-methoxyphenyl)-5-oxopyrrolidine-3-carbohydrazide::N'-[(Z)-indol-3-ylidenemethyl]-5-keto-1-(4-methoxyphenyl)pyrrolidine-3-carbohydrazide::cid_5347164
SMILES COc1ccc(cc1)N1CC(CC1=O)C(=O)NN=Cc1c[nH]c2ccccc12
InChI Key InChIKey=ONRICFVLRAYPPC-FSJBWODESA-N
Data  1 IC50
  Tab Delimited (TSV)   2D SDfile   Computed 3D by Vconf -m prep SDfile
Find this compound or compounds like it in BindingDB:
Activity Spreadsheet -- Enzyme Inhibition Constant Data from BindingDB
Found 1 hit for monomerid = 84058
TargetSentrin-specific protease 8(Homo sapiens (Human))
Burnham Center For Chemical Genomics
Curated by PubChem BioAssay
LigandPNGBDBM84058(MLS-0454612.0002 | N'-[(Z)-3-indolylidenemethyl]-1...)
Affinity DataIC50: >9.90E+4nM. Assay description: Data Source: Sanford-Burnham Center for Chemical Genomics (SBCCG) Source Affiliation: Sanford-Burnham Medical Research Institute (SBMRI, San Diego, C...
In DepthDetails PCBioAssay