BDBM84150 2-(2-methyl-3-oxidanylidene-1,4-benzoxazin-4-yl)-N-(phenylmethyl)-N-(pyridin-2-ylmethyl)ethanamide::2-(2-methyl-3-oxo-1,4-benzoxazin-4-yl)-N-(phenylmethyl)-N-(2-pyridinylmethyl)acetamide::MLS000074618::N-Benzyl-2-(2-methyl-3-oxo-2,3-dihydro-benzo[1,4]oxazin-4-yl)-N-pyridin-2-ylmethyl-acetamide::N-benzyl-2-(2-methyl-3-oxo-1,4-benzoxazin-4-yl)-N-(pyridin-2-ylmethyl)acetamide::N-benzyl-2-(3-keto-2-methyl-1,4-benzoxazin-4-yl)-N-(2-pyridylmethyl)acetamide::SMR000007330::cid_652735
SMILES CC1Oc2ccccc2N(CC(=O)N(Cc2ccccc2)Cc2ccccn2)C1=O
InChI Key InChIKey=HKCIEYIYZFKDLL-UHFFFAOYSA-N
Data  1 IC50
  Tab Delimited (TSV)   2D SDfile   Computed 3D by Vconf -m prep SDfile
Find this compound or compounds like it in BindingDB:
Activity Spreadsheet -- Enzyme Inhibition Constant Data from BindingDB
Found 1 hit for monomerid = 84150
TargetPotassium voltage-gated channel subfamily KQT member 2(Rattus norvegicus)
Johns Hopkins Ion Channel Center
Curated by PubChem BioAssay
LigandPNGBDBM84150(2-(2-methyl-3-oxidanylidene-1,4-benzoxazin-4-yl)-N...)
Affinity DataIC50:  1.00E+3nM. Assay description: Source (MLPCN Center Name): Johns Hopkins Ion Channel Center (JHICC_KCNQ2_Inh_HFCP_IWS_CRC) Center Affiliation: Johns Hopkins University, School of M...
In DepthDetails PCBioAssay