BDBM84155 MLS000117815::N-[1-(2,3-dihydro-1,4-benzodioxin-6-yl)ethyl]-2-keto-3,8-dimethyl-1-oxaspiro[4.5]dec-3-ene-4-carboxamide::N-[1-(2,3-dihydro-1,4-benzodioxin-6-yl)ethyl]-3,8-dimethyl-2-oxidanylidene-1-oxaspiro[4.5]dec-3-ene-4-carboxamide::N-[1-(2,3-dihydro-1,4-benzodioxin-6-yl)ethyl]-3,8-dimethyl-2-oxo-1-oxaspiro[4.5]dec-3-ene-4-carboxamide::SMR000094763::cid_5307912
SMILES CC(NC(=O)C1=C(C)C(=O)OC11CCC(C)CC1)c1ccc2OCCOc2c1
InChI Key InChIKey=LSINAYJHQKACRA-UHFFFAOYSA-N
Data  1 IC50
  Tab Delimited (TSV)   2D SDfile   Computed 3D by Vconf -m prep SDfile
Find this compound or compounds like it in BindingDB:
Activity Spreadsheet -- Enzyme Inhibition Constant Data from BindingDB
Found 1 hit for monomerid = 84155
TargetPotassium voltage-gated channel subfamily KQT member 2(Rattus norvegicus)
Johns Hopkins Ion Channel Center
Curated by PubChem BioAssay
LigandPNGBDBM84155(MLS000117815 | N-[1-(2,3-dihydro-1,4-benzodioxin-6...)
Affinity DataIC50:  1.20E+4nM. Assay description: Source (MLPCN Center Name): Johns Hopkins Ion Channel Center (JHICC_KCNQ2_Inh_HFCP_IWS_CRC) Center Affiliation: Johns Hopkins University, School of M...
Ligand InfoPC cidPC sid
In DepthDetails PCBioAssay