BDBM84163 MLS000571129::N-(3,5-dichlorophenyl)-2-(2-methoxyethylamino)-2-phenyl-acetamide::N-(3,5-dichlorophenyl)-2-(2-methoxyethylamino)-2-phenylacetamide::N-[3,5-bis(chloranyl)phenyl]-2-(2-methoxyethylamino)-2-phenyl-ethanamide::SMR000150811::cid_3951051
SMILES COCCNC(C(=O)Nc1cc(Cl)cc(Cl)c1)c1ccccc1
InChI Key InChIKey=HYAYHKSPYUKJLE-UHFFFAOYSA-N
Data  1 IC50
  Tab Delimited (TSV)   2D SDfile   Computed 3D by Vconf -m prep SDfile
Find this compound or compounds like it in BindingDB:
Activity Spreadsheet -- Enzyme Inhibition Constant Data from BindingDB
Found 1 hit for monomerid = 84163
TargetPotassium voltage-gated channel subfamily KQT member 2(Rattus norvegicus)
Johns Hopkins Ion Channel Center
Curated by PubChem BioAssay
LigandPNGBDBM84163(MLS000571129 | N-(3,5-dichlorophenyl)-2-(2-methoxy...)
Affinity DataIC50:  1.61E+4nM. Assay description: Source (MLPCN Center Name): Johns Hopkins Ion Channel Center (JHICC_KCNQ2_Inh_HFCP_IWS_CRC) Center Affiliation: Johns Hopkins University, School of M...
In DepthDetails PCBioAssay