BDBM8417 (5Z)-3-(4-hydroxyphenyl)-5-{[5-(4-nitrophenyl)furan-2-yl]methylidene}-2-sulfanylidene-1,3-thiazolidin-4-one::Rhodanine-furan analogue 4
SMILES Oc1ccc(cc1)N1C(=S)S\C(=C/c2ccc(o2)-c2ccc(cc2)N(=O)=O)C1=O
InChI Key InChIKey=SKPKAGXQCUOFRC-WQRHYEAKSA-N
Data  1 IC50
  Tab Delimited (TSV)   2D SDfile   Computed 3D by Vconf -m prep SDfile
Find this compound or compounds like it in BindingDB:
Activity Spreadsheet -- Enzyme Inhibition Constant Data from BindingDB
Found 1 hit for monomerid = 8417
TargetLethal factor(Bacillus anthracis)
Burnham Institute For Medical Research
LigandPNGBDBM8417((5Z)-3-(4-hydroxyphenyl)-5-{[5-(4-nitrophenyl)fura...)
Affinity DataIC50:  3.77E+4nMpH: 7.4 T: 2°C. Assay description: Fluorescence peptide cleavage assay was performed in a 96-well plate. Each reaction contained MAPKKide, LF, and the small-molecule inhibitor. The C-t...
In DepthDetails ArticlePubMed