BDBM84366 (4-phenylphenyl) morpholine-4-carboxylate::4-biphenylyl 4-morpholinecarboxylate::4-morpholinecarboxylic acid (4-phenylphenyl) ester::MLS000058870::SMR000069439::cid_1378785::morpholine-4-carboxylic acid (4-phenylphenyl) ester
SMILES O=C(Oc1ccc(cc1)-c1ccccc1)N1CCOCC1
InChI Key InChIKey=WQDLUJWWLAQRFC-UHFFFAOYSA-N
Data  1 IC50
  Tab Delimited (TSV)   2D SDfile   Computed 3D by Vconf -m prep SDfile
Find this compound or compounds like it in BindingDB:
Activity Spreadsheet -- Enzyme Inhibition Constant Data from BindingDB
Found 1 hit for monomerid = 84366
TargetPlatelet-activating factor acetylhydrolase(Mus musculus)
The Scripps Research Institute Molecular Screening Center
Curated by PubChem BioAssay
LigandPNGBDBM84366((4-phenylphenyl) morpholine-4-carboxylate | 4-biph...)
Affinity DataIC50:  469nM. Assay description: University of New Mexico Assay Overview: Assay Support: R03 MH093192-01 Project Title: HTS for Non-Canonical Ligands for Beta 2 Adrenergic Receptor...
In DepthDetails PCBioAssay