BDBM84479 Bi-substrate Inhibitor, 1e
SMILES Nc1ncnc2n(cnc12)[C@@H]1O[C@H](\C=C\CNC(=O)c2cc(cc(O)c2O)-c2nccs2)[C@@H](O)[C@H]1O
InChI Key InChIKey=FBOWRQRRHCFCJF-FNORDPGFSA-N
Data  1 IC50
  Tab Delimited (TSV)   2D SDfile   Computed 3D by Vconf -m prep SDfile
Find this compound or compounds like it in BindingDB:
Activity Spreadsheet -- Enzyme Inhibition Constant Data from BindingDB
Found 1 hit for monomerid = 84479
TargetCatechol O-methyltransferase(Rattus norvegicus (Rat))
Laboratorium FÜR Organische Chemie
LigandPNGBDBM84479(Bi-substrate Inhibitor, 1e)
Affinity DataIC50:  27nMT: 2°C. Assay description: The binding affinity of the inhibitors towards Catechol O-methyltransferase in the presence of Mg2+ ions were determined by using a radiochemical ass...
In DepthDetails ArticlePubMed