BDBM84575 VS-54
SMILES Oc1cccc(c1)C1NC(=S)Nc2cc(F)ccc12
InChI Key InChIKey=YFCQKEDOZFMWBS-UHFFFAOYSA-N
Data  1 IC50
  Tab Delimited (TSV)   2D SDfile   Computed 3D by Vconf -m prep SDfile
Find this compound or compounds like it in BindingDB:
Activity Spreadsheet -- Enzyme Inhibition Constant Data from BindingDB
Found 1 hit for monomerid = 84575
TargetKinesin-like protein KIF11(Homo sapiens (Human))
University Of Leipzig
LigandPNGBDBM84575(VS-54)
Affinity DataIC50:  1.81E+3nMpH: 6.8 T: 2°C. Assay description: The ATPase activity of the Eg5 motor domain was measured by using the malachite green assay.
In DepthDetails ArticlePubMed