BDBM84665 Piperazine moiety, 5
SMILES NS(=O)(=O)c1ccc(cc1)N1CCN(CCO)CC1
InChI Key InChIKey=RTWAZOAUCCQCQN-UHFFFAOYSA-N
Data  1 IC50  1 Kd
  Tab Delimited (TSV)   2D SDfile   Computed 3D by Vconf -m prep SDfile
Find this compound or compounds like it in BindingDB:
Activity Spreadsheet -- Enzyme Inhibition Constant Data from BindingDB
Found 1 hit for monomerid = 84665
TargetCarbonic anhydrase 2(Homo sapiens (Human))
Antibiotics Laboratory
LigandPNGBDBM84665(Piperazine moiety, 5)
Affinity DataIC50:  137nM Kd:  208nMpH: 8.4Assay Description:Inhibitory activity of the compounds for CAII was measured and IC50 values were calculated from independent triplicated experiments. Kd values were ...
In DepthDetails ArticlePubMed