BDBM84764 (18) 1H-1,2,4-triazol-3-yl-anilines 2-(Quinolinyl) 4-Pyridine
SMILES N(c1ccncc1)c1ccccc1-c1ncn(n1)-c1ccc2ccccc2n1
InChI Key InChIKey=GLGKCLVOGUJPBF-UHFFFAOYSA-N
Data  2 IC50
  Tab Delimited (TSV)   2D SDfile   Computed 3D by Vconf -m prep SDfile
Find this compound or compounds like it in BindingDB:
Activity Spreadsheet -- Enzyme Inhibition Constant Data from BindingDB
Found 2 hits for monomerid = 84764
TargetVascular endothelial growth factor receptor 1(Homo sapiens (Human))
Chemdiv
LigandPNGBDBM84764((18) 1H-1,2,4-triazol-3-yl-anilines 2-(Quinolinyl)...)
Affinity DataIC50:  560nMpH: 7.5 T: 2°C. Assay description: In a representative synthetic procedure (compound 3), a mixture of 1 (330 mg, 2 mM) and 3-F3C-C6H4-NHNH2 (370 mg, 2.1 mM) in anisole (20 mL) was stir...
Ligand InfoPC cidPC sid
In DepthDetails ArticlePubMed
TargetVascular endothelial growth factor receptor 2(Homo sapiens (Human))
Chemdiv
LigandPNGBDBM84764((18) 1H-1,2,4-triazol-3-yl-anilines 2-(Quinolinyl)...)
Affinity DataIC50:  350nMpH: 7.5 T: 2°C. Assay description: In a representative synthetic procedure (compound 3), a mixture of 1 (330 mg, 2 mM) and 3-F3C-C6H4-NHNH2 (370 mg, 2.1 mM) in anisole (20 mL) was stir...
Ligand InfoPC cidPC sid
In DepthDetails ArticlePubMed