BDBM84816 1-azolyl-4-phenyl-2-butanone, 18::1-azolyl-4-phenyl-2-butanone, 19
SMILES COOCc1nccn1CC(=O)CCc1ccccc1
InChI Key InChIKey=NDXYGSIXJIKDPB-UHFFFAOYSA-N
Data  4 IC50
  Tab Delimited (TSV)   2D SDfile   Computed 3D by Vconf -m prep SDfile
Find this compound or compounds like it in BindingDB:
Activity Spreadsheet -- Enzyme Inhibition Constant Data from BindingDB
Found 4 hits for monomerid = 84816
TargetHeme oxygenase 1(Rattus norvegicus (rat))
Queen'S University
LigandPNGBDBM84816(1-azolyl-4-phenyl-2-butanone, 18 | 1-azolyl-4-phen...)
Affinity DataIC50: >1.00E+5nMpH: 7.4 T: 2°C. Assay description: Heme oxygenase activity in rat spleen and brain microsomal fractions was determined by the quantitation of CO formed from the degradation of methemal...
In DepthDetails ArticlePubMed
TargetHeme oxygenase 2(Rattus norvegicus (rat))
Queen'S University
LigandPNGBDBM84816(1-azolyl-4-phenyl-2-butanone, 18 | 1-azolyl-4-phen...)
Affinity DataIC50: >1.00E+5nMpH: 7.4 T: 2°C. Assay description: Heme oxygenase activity in rat spleen and brain microsomal fractions was determined by the quantitation of CO formed from the degradation of methemal...
In DepthDetails ArticlePubMed
TargetHeme oxygenase 2(Rattus norvegicus (rat))
Queen'S University
LigandPNGBDBM84816(1-azolyl-4-phenyl-2-butanone, 18 | 1-azolyl-4-phen...)
Affinity DataIC50: >1.00E+5nMpH: 7.4 T: 2°C. Assay description: Heme oxygenase activity in rat spleen and brain microsomal fractions was determined by the quantitation of CO formed from the degradation of methemal...
In DepthDetails ArticlePubMed
TargetHeme oxygenase 1(Rattus norvegicus (rat))
Queen'S University
LigandPNGBDBM84816(1-azolyl-4-phenyl-2-butanone, 18 | 1-azolyl-4-phen...)
Affinity DataIC50: >1.00E+5nMpH: 7.4 T: 2°C. Assay description: Heme oxygenase activity in rat spleen and brain microsomal fractions was determined by the quantitation of CO formed from the degradation of methemal...
In DepthDetails ArticlePubMed