BDBM84848 1-azolyl-4-phenyl-2-butanone, 50
SMILES C(CC1(Cn2cncn2)OCCO1)c1ccccc1
InChI Key InChIKey=IAUHPNGQEQTQDL-UHFFFAOYSA-N
Data  2 IC50
  Tab Delimited (TSV)   2D SDfile   Computed 3D by Vconf -m prep SDfile
Find this compound or compounds like it in BindingDB:
Activity Spreadsheet -- Enzyme Inhibition Constant Data from BindingDB
Found 2 hits for monomerid = 84848
TargetHeme oxygenase 2(Rattus norvegicus (rat))
Queen'S University
LigandPNGBDBM84848(1-azolyl-4-phenyl-2-butanone, 50)
Affinity DataIC50: >1.00E+5nMpH: 7.4 T: 2°C. Assay description: Heme oxygenase activity in rat spleen and brain microsomal fractions was determined by the quantitation of CO formed from the degradation of methemal...
In DepthDetails ArticlePubMed
TargetHeme oxygenase 1(Rattus norvegicus (rat))
Queen'S University
LigandPNGBDBM84848(1-azolyl-4-phenyl-2-butanone, 50)
Affinity DataIC50:  1.30E+4nMpH: 7.4 T: 2°C. Assay description: Heme oxygenase activity in rat spleen and brain microsomal fractions was determined by the quantitation of CO formed from the degradation of methemal...
In DepthDetails ArticlePubMed