BDBM8489 (2R)-N-hydroxy-2-[(4-hydroxy-3-methylbenzene)sulfonamido]-3-methylbutanamide::hydroxamate analogue 26
SMILES CC(C)[C@@H](NS(=O)(=O)c1ccc(O)c(C)c1)C(=O)NO
InChI Key InChIKey=INNHLNZQOUXHQB-LLVKDONJSA-N
Data  1 IC50
  Tab Delimited (TSV)   2D SDfile   Computed 3D by Vconf -m prep SDfile
Find this compound or compounds like it in BindingDB:
Activity Spreadsheet -- Enzyme Inhibition Constant Data from BindingDB
Found 1 hit for monomerid = 8489
TargetLethal factor(Bacillus anthracis)
Merck Research Laboratories
LigandPNGBDBM8489((2R)-N-hydroxy-2-[(4-hydroxy-3-methylbenzene)sulfo...)
Affinity DataIC50:  1.64E+3nM. Assay description: The assay was performed in a 96-well plate, each well contained substrate peptide, LF, and the test compound. The C-terminally fluorophore of substra...
In DepthDetails ArticlePubMed