BDBM84892 THC, 1-O-(4-Aminobutyl)
SMILES CCCCCc1cc(OCCCCN)c2[C@@H]3C=C(C)CC[C@H]3C(C)(C)Oc2c1
InChI Key InChIKey=LDAMDBCCADIHEQ-NHCUHLMSSA-N
Data  1 KI
  Tab Delimited (TSV)   2D SDfile   Computed 3D by Vconf -m prep SDfile
Find this compound or compounds like it in BindingDB:
Activity Spreadsheet -- Enzyme Inhibition Constant Data from BindingDB
Found 1 hit for monomerid = 84892
TargetCannabinoid receptor 1(Rattus norvegicus (rat))
Virginia Commonwealth University
Curated by PDSP Ki Database
LigandPNGBDBM84892(THC, 1-O-(4-Aminobutyl))
Affinity DataKi: >1.00E+4nM
In DepthDetails PubMed