BDBM84963 Urea derivative, 7
SMILES COc1ccc(NC(=O)Nc2ccc(\C=C\c3ccc(O)c(O)c3)cc2)cc1
InChI Key InChIKey=LPZHHGVKDSOKQD-NSCUHMNNSA-N
Data  1 KI  1 IC50
  Tab Delimited (TSV)   2D SDfile   Computed 3D by Vconf -m prep SDfile
Find this compound or compounds like it in BindingDB:
Activity Spreadsheet -- Enzyme Inhibition Constant Data from BindingDB
Found 1 hit for monomerid = 84963
TargetAlpha-glucosidase MAL12(Saccharomyces cerevisiae)
Gyeongsang National University
LigandPNGBDBM84963(Urea derivative, 7)
Affinity DataKi:  1.05E+4nM IC50:  1.95E+4nM. Assay description: All enzymatic activities were determined by using the appropriate substrate (p-nitrophenyl-alpha-D-glucopyranoside, p-nitrophenyl-beta-D-gulcopyranos...
In DepthDetails ArticlePubMed