BDBM84977 6-methoxy kaempferol
SMILES COc1c(O)cc2oc(-c3ccc(O)cc3)c(O)c(=O)c2c1O
InChI Key InChIKey=OGQSUSFDBWGFFJ-UHFFFAOYSA-N
Data  2 IC50
  Tab Delimited (TSV)   2D SDfile   Computed 3D by Vconf -m prep SDfile
Find this compound or compounds like it in BindingDB:
Activity Spreadsheet -- Enzyme Inhibition Constant Data from BindingDB
Found 2 hits for monomerid = 84977
TargetMitogen-activated protein kinase 10(Homo sapiens (Human))
Eberhard Karls University Of Tuebingen
LigandPNGBDBM84977(6-methoxy kaempferol)
Affinity DataIC50:  2.24E+4nMT: 2°C. Assay description: The p38alpha reaction was carried out by using kinase (12ng per well), ATP (100uM) and incubated for 60 min at 37 C. For the JNK3 assay, kinase (10n...
In DepthDetails ArticlePubMed
TargetMitogen-activated protein kinase 14(Homo sapiens (Human))
Eberhard Karls University Of Tuebingen
LigandPNGBDBM84977(6-methoxy kaempferol)
Affinity DataIC50:  1.72E+4nMT: 2°C. Assay description: The p38alpha reaction was carried out by using kinase (12ng per well), ATP (100uM) and incubated for 60 min at 37 C. For the JNK3 assay, kinase (10n...
In DepthDetails ArticlePubMed