BDBM85088 SFLLR-OH
SMILES [#6]-[#6](-[#6])-[#6]-[#6@H](-[#7]-[#6](=O)-[#6@H](-[#6]-[#6](-[#6])-[#6])-[#7]-[#6](=O)-[#6@H](-[#6]-c1ccccc1)-[#7]-[#6](=O)-[#6@@H](-[#7])-[#6]-[#8])-[#6](=O)-[#7]-[#6@@H](-[#6]-[#6]-[#6]\[#7]=[#6](\[#7])-[#7])-[#6](-[#8])=O
InChI Key InChIKey=LJYDIYITSYDTAY-LSBAASHUSA-N
Data  2 KI
  Tab Delimited (TSV)   2D SDfile   Computed 3D by Vconf -m prep SDfile
Find this compound or compounds like it in BindingDB:
Activity Spreadsheet -- Enzyme Inhibition Constant Data from BindingDB
Found 2 hits for monomerid = 85088
TargetProteinase-activated receptor 2(RAT)
The University Of Calgary
Curated by PDSP Ki Database
LigandPNGBDBM85088(SFLLR-OH)
Affinity DataKi: >1.00E+4nM
In DepthDetails PubMed
TargetProthrombin(Homo sapiens (Human))
Schering-Plough Research Institute
Curated by PDSP Ki Database
LigandPNGBDBM85088(SFLLR-OH)
Affinity DataKi: >1.00E+4nM
In DepthDetails ArticlePubMed