BDBM851 (2R,3R,4R,5R)-3,4-dihydroxy-N,N'-bis[(1S)-2-methyl-1-(methylcarbamoyl)propyl]-2,5-bis({[4-(pyridin-3-yl)phenyl]methoxy})hexanediamide::C2-Symmetric inhibitor 9::N1,N6-Bis[(1S)-2-methyl-1-(methylcarbamoyl)propyl]-(2R,3R,4R,5R)-2,5-bis[4-(3-pyridyl)benzyloxy]-3,4-dihydroxyhexanediamide::symmetric/asymmetric inhibitor 8
SMILES CNC(=O)[C@@H](NC(=O)[C@H](OCc1ccc(cc1)-c1cccnc1)[C@H](O)[C@@H](O)[C@@H](OCc1ccc(cc1)-c1cccnc1)C(=O)N[C@@H](C(C)C)C(=O)NC)C(C)C
InChI Key InChIKey=FOBRXMROTNVGST-CXPJILFNSA-N
Data  2 KI
PDB links: 1 PDB ID matches this monomer.
  Tab Delimited (TSV)   2D SDfile   Computed 3D by Vconf -m prep SDfile
Find this compound or compounds like it in BindingDB:
Activity Spreadsheet -- Enzyme Inhibition Constant Data from BindingDB
Found 2 hits for monomerid = 851
TargetDimer of Gag-Pol polyprotein [489-587](Human immunodeficiency virus type 1)
Uppsala University
LigandPNGBDBM851((2R,3R,4R,5R)-3,4-dihydroxy-N,N'-bis[(1S)-2-methyl...)
Affinity DataKi:  0.100nM ΔG°:  -13.9kcal/molepH: 5.0 T: 2°C. Assay description: A fluorimetric assay was used to determine the effects of the inhibitors on HIV-1 protease. This assay used an internally quenched fluorescent peptid...
TargetDimer of Gag-Pol polyprotein [501-599](Human immunodeficiency virus type 1)
Uppsala University
LigandPNGBDBM851((2R,3R,4R,5R)-3,4-dihydroxy-N,N'-bis[(1S)-2-methyl...)
Affinity DataKi:  0.300nM ΔG°:  -13.2kcal/molepH: 5.0 T: 2°C. Assay description: Ki values were determined by using a fluorescent substrate (DABCYL-gamma-Abu-Ser-Gln-Asn-Tyr-Pro-Ile-Val-Gln-EDANS). All incubations were performed a...