BDBM85118 Cyclophilin Inhibitor, 3d
SMILES COC(=O)[C@H](CCCCNC(C)=O)C1C(=O)CC2C1=CC(=O)CC2(C)C
InChI Key InChIKey=VINWJYXOFBHHFU-MXWWQKGMSA-N
Data  1 KI  1 Kd
  Tab Delimited (TSV)   2D SDfile   Computed 3D by Vconf -m prep SDfile
Find this compound or compounds like it in BindingDB:
Activity Spreadsheet -- Enzyme Inhibition Constant Data from BindingDB
Found 2 hits for monomerid = 85118
TargetPeptidyl-prolyl cis-trans isomerase A(Homo sapiens (Human))
The University Of Edinburgh
LigandPNGBDBM85118(Cyclophilin Inhibitor, 3d)
Affinity DataKi: >1.00E+5nM. Assay description: The promising ligand from the results obtained from ESI-MS assay are subjected to PPIase in vitro assay. The PPIase assay assesses the abil9ity of l...
In DepthDetails ArticlePubMed
TargetPeptidyl-prolyl cis-trans isomerase A(Homo sapiens (Human))
The University Of Edinburgh
LigandPNGBDBM85118(Cyclophilin Inhibitor, 3d)
Affinity DataKd:  8.51E+4nM. Assay description: Electrospray mass spectrometry assay is a immunophilin-ligand binding assay which allows us to rapidly probe the affinity of potential inhibitors for...
In DepthDetails ArticlePubMed