BDBM85204 Gal-(1-15)-ol,[d-Thr6,d-Trp8,9]
SMILES CC(C)C[C@H](NC(=O)[C@H](CC(C)C)NC(=O)[C@@H](Cc1c[nH]c2ccccc12)NC(=O)[C@@H](Cc1c[nH]c2ccccc12)NC(=O)[C@H](C)NC(=O)[C@H](NC(=O)[C@H](CC(N)=O)NC(=O)[C@H](CC(C)C)NC(=O)[C@@H](NC(=O)[C@H](Cc1c[nH]c2ccccc12)NC(=O)CN)[C@@H](C)O)C(C)O)C(=O)NCC(=O)N1CCC[C@H]1C(=O)N[C@@H](Cc1cnc[nH]1)C(=O)N[C@@H](C)C(O)=O
InChI Key InChIKey=HQNBXAAQODTCQJ-BLYXYECMSA-N
Data  1 KI
  Tab Delimited (TSV)   2D SDfile   Computed 3D by Vconf -m prep SDfile
Find this compound or compounds like it in BindingDB:
Activity Spreadsheet -- Enzyme Inhibition Constant Data from BindingDB
Found 1 hit for monomerid = 85204
TargetGalanin receptor type 3(RAT)
Schering-Plough Research Institute
Curated by PDSP Ki Database
LigandPNGBDBM85204(Gal-(1-15)-ol,[d-Thr6,d-Trp8,9])
Affinity DataKi:  1.00E+3nM
In DepthDetails ArticlePubMed