BDBM85263 Benzimidazole derivative, 4
SMILES C(=C/c1ccccc1)\c1nc2ccccc2[nH]1
InChI Key InChIKey=QQLPPRIZUPEKMV-ZHACJKMWSA-N
Data  1 IC50
  Tab Delimited (TSV)   2D SDfile   Computed 3D by Vconf -m prep SDfile
Find this compound or compounds like it in BindingDB:
Activity Spreadsheet -- Enzyme Inhibition Constant Data from BindingDB
Found 1 hit for monomerid = 85263
TargetDipeptidyl peptidase 3(Homo sapiens (Human))
The Josip Juraj Strossmayer University
LigandPNGBDBM85263(Benzimidazole derivative, 4)
Affinity DataIC50: >1.00E+5nMpH: 7.4 T: 2°C. Assay description: The IC50 value is defined as the concentration of an inhibitor with caused 50% reduction of the enzyme activity under specific condition. The princi...
In DepthDetails ArticlePubMed