BDBM85265 2,4-Disubstituted-1,3-di-(5-amidino-2-benzoimidazolyl)-cyclobutane hydrochoride, 2'
SMILES NC(=[NH2+])c1ccc2nc([nH]c2c1)C1C(C(C1c1ccccc1)c1nc2ccc(cc2[nH]1)C(N)=[NH2+])c1ccccc1
InChI Key InChIKey=UUWHVVJJKSALKK-UHFFFAOYSA-P
Data  1 IC50
  Tab Delimited (TSV)   2D SDfile   Computed 3D by Vconf -m prep SDfile
Find this compound or compounds like it in BindingDB:
Activity Spreadsheet -- Enzyme Inhibition Constant Data from BindingDB
Found 1 hit for monomerid = 85265
TargetDipeptidyl peptidase 3(Homo sapiens (Human))
The Josip Juraj Strossmayer University
LigandPNGBDBM85265(2,4-Disubstituted-1,3-di-(5-amidino-2-benzoimidazo...)
Affinity DataIC50:  5.60E+3nMpH: 7.4 T: 2°C. Assay description: The IC50 value is defined as the concentration of an inhibitor with caused 50% reduction of the enzyme activity under specific condition. The princi...
In DepthDetails ArticlePubMed