BDBM85271 2,4-Disubstituted-1,3-di-(5-amidino-2-benzoimidazolyl)-cyclobutane hydrochoride, 8'
SMILES C1C[NH+]=C(N1)c1ccc2nc([nH]c2c1)C1C(C(C1c1cccs1)c1nc2ccc(cc2[nH]1)C1=[NH+]CCN1)c1cccs1
InChI Key InChIKey=FTLSJOKIGPJTNK-UHFFFAOYSA-P
Data  1 IC50
  Tab Delimited (TSV)   2D SDfile   Computed 3D by Vconf -m prep SDfile
Find this compound or compounds like it in BindingDB:
Activity Spreadsheet -- Enzyme Inhibition Constant Data from BindingDB
Found 1 hit for monomerid = 85271
TargetDipeptidyl peptidase 3(Homo sapiens (Human))
The Josip Juraj Strossmayer University
LigandPNGBDBM85271(2,4-Disubstituted-1,3-di-(5-amidino-2-benzoimidazo...)
Affinity DataIC50:  1.00E+4nMpH: 7.4 T: 2°C. Assay description: The IC50 value is defined as the concentration of an inhibitor with caused 50% reduction of the enzyme activity under specific condition. The princi...
Ligand InfoPC cidPC sid
In DepthDetails ArticlePubMed