BDBM85341 CAS_4336830::NSC_4336830::SC19220
SMILES CC(=O)NN=C(O)N1Cc2ccccc2Oc2ccc(Cl)cc12
InChI Key InChIKey=KNURFLJTOUGOOQ-UHFFFAOYSA-N
Data  2 KI
  Tab Delimited (TSV)   2D SDfile   Computed 3D by Vconf -m prep SDfile
Find this compound or compounds like it in BindingDB:
Activity Spreadsheet -- Enzyme Inhibition Constant Data from BindingDB
Found 2 hits for monomerid = 85341
TargetProstaglandin E2 receptor EP3 subtype(BOVINE)
Alcon Laboratories
Curated by PDSP Ki Database
LigandPNGBDBM85341(CAS_4336830 | NSC_4336830 | SC19220)
Affinity DataKi:  3.00E+3nM
In DepthDetails PubMed
TargetProstaglandin E2 receptor EP3 subtype(BOVINE)
Alcon Laboratories
Curated by PDSP Ki Database
LigandPNGBDBM85341(CAS_4336830 | NSC_4336830 | SC19220)
Affinity DataKi: >1.00E+4nM
In DepthDetails PubMed