BDBM85353 (R)-HIBO::CAS_194385::NSC_194385
SMILES N[C@H](Cc1cc(=O)[nH]o1)C(O)=O
InChI Key InChIKey=PEHXWVXZPICGAV-SCSAIBSYSA-N
Data  4 KI
  Tab Delimited (TSV)   2D SDfile   Computed 3D by Vconf -m prep SDfile
Find this compound or compounds like it in BindingDB:
Activity Spreadsheet -- Enzyme Inhibition Constant Data from BindingDB
Found 4 hits for monomerid = 85353
TargetMetabotropic glutamate receptor 1(RAT)
The Royal Danish School Of Pharmacy
Curated by PDSP Ki Database
LigandPNGBDBM85353((R)-HIBO | CAS_194385 | NSC_194385)
Affinity DataKi: >1.00E+4nM
In DepthDetails ArticlePubMed
TargetMetabotropic glutamate receptor 5(Rattus norvegicus (Rat))
The Royal Danish School Of Pharmacy
Curated by PDSP Ki Database
LigandPNGBDBM85353((R)-HIBO | CAS_194385 | NSC_194385)
Affinity DataKi: >1.00E+4nM
In DepthDetails ArticlePubMed
TargetMetabotropic glutamate receptor 4(Rattus norvegicus (Rat))
The Royal Danish School Of Pharmacy
Curated by PDSP Ki Database
LigandPNGBDBM85353((R)-HIBO | CAS_194385 | NSC_194385)
Affinity DataKi: >1.00E+4nM
In DepthDetails ArticlePubMed
TargetMetabotropic glutamate receptor 2(Homo sapiens (Human))
The Royal Danish School Of Pharmacy
Curated by PDSP Ki Database
LigandPNGBDBM85353((R)-HIBO | CAS_194385 | NSC_194385)
Affinity DataKi: >1.00E+4nM
In DepthDetails ArticlePubMed