BDBM85526 CAS_190964::I-APE::NSC_190964
SMILES Nc1ccc(CCNc2nc(N)c3ncn(C4OC(CO)C(O)C4O)c3n2)cc1I
InChI Key InChIKey=AFFIAFORFZHTLX-UHFFFAOYSA-N
Data  1 KI
  Tab Delimited (TSV)   2D SDfile   Computed 3D by Vconf -m prep SDfile
Find this compound or compounds like it in BindingDB:
Activity Spreadsheet -- Enzyme Inhibition Constant Data from BindingDB
Found 1 hit for monomerid = 85526
TargetAdenosine receptor A2b(Homo sapiens (Human))
University Of Virginia
Curated by PDSP Ki Database
LigandPNGBDBM85526(CAS_190964 | I-APE | NSC_190964)
Affinity DataKi: >1.00E+4nM
In DepthDetails PubMed