BDBM85570 7-Hydroxy-flavone, 5e
SMILES Oc1ccc2c(c1)oc(cc2=O)-c1ccc(cc1)N(=O)=O
InChI Key InChIKey=OPUYQGBDVLHIPY-UHFFFAOYSA-N
Data  1 IC50
  Tab Delimited (TSV)   2D SDfile   Computed 3D by Vconf -m prep SDfile
Find this compound or compounds like it in BindingDB:
Activity Spreadsheet -- Enzyme Inhibition Constant Data from BindingDB
Found 1 hit for monomerid = 85570
TargetAromatase(Homo sapiens (Human))
Cardiff University
LigandPNGBDBM85570(7-Hydroxy-flavone, 5e)
Affinity DataIC50: >2.00E+4nMT: 2°C. Assay description: The classical 3H2O assay was used to measure the effect of the flavones on aromatase activity using human placental microsomes.
In DepthDetails ArticlePubMed