BDBM85617 MPC-NECA
SMILES COc1ccc(cc1)C(=O)Nc1ncnc2n(cnc12)C1OC(CCC(N)=O)C(O)C1O
InChI Key InChIKey=DBIDNYFJFLDOAW-UHFFFAOYSA-N
Data  2 KI
  Tab Delimited (TSV)   2D SDfile   Computed 3D by Vconf -m prep SDfile
Find this compound or compounds like it in BindingDB:
Activity Spreadsheet -- Enzyme Inhibition Constant Data from BindingDB
Found 2 hits for monomerid = 85617
TargetAdenosine receptor A3(Homo sapiens (Human))
University Of Ferrara
Curated by PDSP Ki Database
LigandPNGBDBM85617(MPC-NECA)
Affinity DataKi:  10nM
In DepthDetails PubMed
TargetAdenosine receptor A3(Homo sapiens (Human))
University Of Ferrara
Curated by PDSP Ki Database
LigandPNGBDBM85617(MPC-NECA)
Affinity DataKi:  380nM
In DepthDetails PubMed