BDBM85688 CAS_126534::LTA4-ME::NSC_126534
SMILES CCCCCC=CCC=CC=CC=CC1OC1CCCC(=O)OC
InChI Key InChIKey=WTKAVFHPLJFCMZ-UHFFFAOYSA-N
Data  2 KI
  Tab Delimited (TSV)   2D SDfile   Computed 3D by Vconf -m prep SDfile
Find this compound or compounds like it in BindingDB:
Activity Spreadsheet -- Enzyme Inhibition Constant Data from BindingDB
Found 2 hits for monomerid = 85688
TargetLeukotriene B4 receptor 2(Homo sapiens (Human))
Schering-Plough Research Institute
Curated by PDSP Ki Database
LigandPNGBDBM85688(CAS_126534 | LTA4-ME | NSC_126534)
Affinity DataKi: >1.00E+4nM
In DepthDetails ArticlePubMed
TargetLeukotriene B4 receptor 1(Homo sapiens (Human))
Schering-Plough Research Institute
Curated by PDSP Ki Database
LigandPNGBDBM85688(CAS_126534 | LTA4-ME | NSC_126534)
Affinity DataKi: >1.00E+4nM
In DepthDetails ArticlePubMed