BDBM85722 BAY u9773::CAS_134733-55-4
SMILES CCCCC\C=C/C\C=C\C=C\C=C\[C@@H](Sc1ccc(cc1)C(O)=O)[C@@H](O)CCCC(O)=O
InChI Key InChIKey=PKJINWOACFYDQN-FFVQPXRTSA-N
Data  1 KI
  Tab Delimited (TSV)   2D SDfile   Computed 3D by Vconf -m prep SDfile
Find this compound or compounds like it in BindingDB:
Activity Spreadsheet -- Enzyme Inhibition Constant Data from BindingDB
Found 1 hit for monomerid = 85722
TargetCysteinyl leukotriene receptor 2(Homo sapiens (Human))
University Of California Irvine
Curated by PDSP Ki Database
LigandPNGBDBM85722(BAY u9773 | CAS_134733-55-4)
Affinity DataKi:  300nM
In DepthDetails ArticlePubMed