BDBM8597 (3-Pyridylmethylene)indane 19a::3-{[(1E)-5-ethoxy-2,3-dihydro-1H-inden-1-ylidene]methyl}pyridine
SMILES CCOc1ccc2\C(CCc2c1)=C\c1cccnc1
InChI Key InChIKey=PXXLKRIIKURDBT-GXDHUFHOSA-N
Data  5 IC50
  Tab Delimited (TSV)   2D SDfile   Computed 3D by Vconf -m prep SDfile
Find this compound or compounds like it in BindingDB:
Activity Spreadsheet -- Enzyme Inhibition Constant Data from BindingDB
Found 5 hits for monomerid = 8597
TargetCytochrome P450 11B1, mitochondrial(Homo sapiens (Human))
Saarland University
LigandPNGBDBM8597((3-Pyridylmethylene)indane 19a | 3-{[(1E)-5-ethoxy...)
Affinity DataIC50:  2.37E+3nM. Assay description: The enzyme activity was assayed by monitoring the conversion of deoxycorticosterone to corticosterone in the presence of inhibitor compounds. The pro...
In DepthDetails ArticlePubMed
TargetCytochrome P450 11B2, mitochondrial(Homo sapiens (Human))
Saarland University
LigandPNGBDBM8597((3-Pyridylmethylene)indane 19a | 3-{[(1E)-5-ethoxy...)
Affinity DataIC50:  79nM. Assay description: The enzyme activity was assayed by monitoring the conversion of deoxycorticosterone to corticosterone in the presence of inhibitor compounds. The pro...
In DepthDetails ArticlePubMed
TargetAromatase(Homo sapiens (Human))
University Of Calcutta
Curated by ChEMBL
LigandPNGBDBM8597((3-Pyridylmethylene)indane 19a | 3-{[(1E)-5-ethoxy...)
Affinity DataIC50:  7.08E+3nM. Assay description: Inhibition of aromatase
In DepthDetails ArticlePubMed
TargetAromatase(Homo sapiens (Human))
University Of Calcutta
Curated by ChEMBL
LigandPNGBDBM8597((3-Pyridylmethylene)indane 19a | 3-{[(1E)-5-ethoxy...)
Affinity DataIC50:  7.08E+3nM. Assay description: Inhibition of aromatase
In DepthDetails ArticlePubMed
TargetAromatase(Homo sapiens (Human))
University Of Calcutta
Curated by ChEMBL
LigandPNGBDBM8597((3-Pyridylmethylene)indane 19a | 3-{[(1E)-5-ethoxy...)
Affinity DataIC50:  7.08E+3nM. Assay description: The enzyme activity was assayed by measuring the 3H-labeled H2O formed from [1beta-3H] Androstenedione during aromatization. After incubation, the re...
In DepthDetails ArticlePubMed