BDBM86106 Isatan B, 6
SMILES OCC1OC(Oc2c[nH]c3ccccc23)C(O)C(=O)C1O
InChI Key InChIKey=AHWQTWBZNABQTO-UHFFFAOYSA-N
Data  2 IC50
  Tab Delimited (TSV)   2D SDfile   Computed 3D by Vconf -m prep SDfile
Find this compound or compounds like it in BindingDB:
Activity Spreadsheet -- Enzyme Inhibition Constant Data from BindingDB
Found 2 hits for monomerid = 86106
TargetLinoleate 9S-lipoxygenase-4(Glycine max (Soybean) (Glycine hispida))
Pcsir Laboratories Complex
LigandPNGBDBM86106(Isatan B, 6)
Affinity DataIC50:  5.38E+4nMpH: 8.0 T: 2°C. Assay description: LOX inhibiting activity was measured by modifying the spectrophotometric method developed by Tappel.
In DepthDetails ArticlePubMed
TargetCarboxylic ester hydrolase(Equus caballus (Horse))
Pcsir Laboratories Complex
LigandPNGBDBM86106(Isatan B, 6)
Affinity DataIC50:  4.76E+4nMpH: 8.0 T: 2°C. Assay description: Butyrylcholinesterase activity-inhibiting activities were measured by a slightly modified spectrophotometric method developed by Ellman. DTNB was us...
In DepthDetails ArticlePubMed