BDBM86164 N1-DnsSpm::N1-dansyl-spermidine
SMILES CN(C)c1cccc2c(cccc12)S(=O)(=O)NCCCNCCCCNCCCN
InChI Key InChIKey=NSUSGNAFCIMCDH-UHFFFAOYSA-N
Data  2 KI  1 IC50
  Tab Delimited (TSV)   2D SDfile   Computed 3D by Vconf -m prep SDfile
Find this compound or compounds like it in BindingDB:
Activity Spreadsheet -- Enzyme Inhibition Constant Data from BindingDB
Found 3 hits for monomerid = 86164
TargetIonotropic glutamate receptor subunit Delta2(Xenopus)
State University Of New York
Curated by PDSP Ki Database
LigandPNGBDBM86164(N1-DnsSpm | N1-dansyl-spermidine)
Affinity DataKi:  1.00E+3nM
In DepthDetails ArticlePubMed
TargetIonotropic glutamate receptor subunit Delta2(Xenopus)
State University Of New York
Curated by PDSP Ki Database
LigandPNGBDBM86164(N1-DnsSpm | N1-dansyl-spermidine)
Affinity DataKi: >1.00E+4nM
In DepthDetails ArticlePubMed
LigandPNGBDBM86164(N1-DnsSpm | N1-dansyl-spermidine)
Affinity DataIC50:  6.50E+4nM. Assay description: Inhibition of calmodulin dependent phosphodiesterase
In DepthDetails ArticlePubMed