BDBM8619 (4-Pyridylmethylene)indane 8b::4-{[(1Z)-5-chloro-2,3-dihydro-1H-inden-1-ylidene]methyl}pyridine
SMILES Clc1ccc2\C(CCc2c1)=C/c1ccncc1
InChI Key InChIKey=NFCDNDMUSHGWSU-XFXZXTDPSA-N
Data  5 IC50
  Tab Delimited (TSV)   2D SDfile   Computed 3D by Vconf -m prep SDfile
Find this compound or compounds like it in BindingDB:
Activity Spreadsheet -- Enzyme Inhibition Constant Data from BindingDB
Found 5 hits for monomerid = 8619
TargetCytochrome P450 11B1, mitochondrial(Homo sapiens (Human))
Saarland University
LigandPNGBDBM8619((4-Pyridylmethylene)indane 8b | 4-{[(1Z)-5-chloro-...)
Affinity DataIC50:  1.12E+3nM. Assay description: The enzyme activity was assayed by monitoring the conversion of deoxycorticosterone to corticosterone in the presence of inhibitor compounds. The pro...
In DepthDetails ArticlePubMed
TargetCytochrome P450 11B2, mitochondrial(Homo sapiens (Human))
Saarland University
LigandPNGBDBM8619((4-Pyridylmethylene)indane 8b | 4-{[(1Z)-5-chloro-...)
Affinity DataIC50:  301nM. Assay description: The enzyme activity was assayed by monitoring the conversion of deoxycorticosterone to corticosterone in the presence of inhibitor compounds. The pro...
In DepthDetails ArticlePubMed
TargetAromatase(Homo sapiens (Human))
University Of Calcutta
Curated by ChEMBL
LigandPNGBDBM8619((4-Pyridylmethylene)indane 8b | 4-{[(1Z)-5-chloro-...)
Affinity DataIC50:  1.99E+3nM. Assay description: Inhibition of aromatase
In DepthDetails ArticlePubMed
TargetAromatase(Homo sapiens (Human))
University Of Calcutta
Curated by ChEMBL
LigandPNGBDBM8619((4-Pyridylmethylene)indane 8b | 4-{[(1Z)-5-chloro-...)
Affinity DataIC50:  1.99E+3nM. Assay description: Inhibition of aromatase
In DepthDetails ArticlePubMed
TargetAromatase(Homo sapiens (Human))
University Of Calcutta
Curated by ChEMBL
LigandPNGBDBM8619((4-Pyridylmethylene)indane 8b | 4-{[(1Z)-5-chloro-...)
Affinity DataIC50:  1.99E+3nM. Assay description: The enzyme activity was assayed by measuring the 3H-labeled H2O formed from [1beta-3H] Androstenedione during aromatization. After incubation, the re...
In DepthDetails ArticlePubMed