BDBM86551 Azanium analog, 3
SMILES CC(CO)(CO)[NH2+]Cc1ccc(o1)-c1cc(Cl)ccc1Cl
InChI Key InChIKey=KEWAJFXKJCLQFC-UHFFFAOYSA-O
Data  3 KI
  Tab Delimited (TSV)   2D SDfile   Computed 3D by Vconf -m prep SDfile
Find this compound or compounds like it in BindingDB:
Activity Spreadsheet -- Enzyme Inhibition Constant Data from BindingDB
Found 3 hits for monomerid = 86551
TargetD(3) dopamine receptor(Homo sapiens (Human))
University Of California San Francisco
LigandPNGBDBM86551(Azanium analog, 3)
Affinity DataKi:  1.60E+3nM ΔG°:  -7.82kcal/molepH: 7.4 T: 2°C. Assay description: Affinities for D3-dopaminergic, D2-dopaminergic and beta2-adrenergic receptors were determined by radioligand competition binding at the National Ins...
In DepthDetails ArticlePubMed
TargetBeta-2 adrenergic receptor(Homo sapiens (Human))
University Of California San Francisco
LigandPNGBDBM86551(Azanium analog, 3)
Affinity DataKi: >1.00E+4nM ΔG°: >-6.75kcal/molepH: 7.4 T: 2°C. Assay description: Affinities for D3-dopaminergic, D2-dopaminergic and beta2-adrenergic receptors were determined by radioligand competition binding at the National Ins...
In DepthDetails ArticlePubMed
TargetD(2) dopamine receptor(Homo sapiens (Human))
University Of California San Francisco
LigandPNGBDBM86551(Azanium analog, 3)
Affinity DataKi: >1.00E+4nM ΔG°: >-6.75kcal/molepH: 7.4 T: 2°C. Assay description: Affinities for D3-dopaminergic, D2-dopaminergic and beta2-adrenergic receptors were determined by radioligand competition binding at the National Ins...
In DepthDetails ArticlePubMed