BDBM86580 ZINC 48057418, 45
SMILES C[NH+](CCCOc1ccccc1)CC(=O)N1CCc2ccccc12
InChI Key InChIKey=QDSQQJZRKQDQSI-UHFFFAOYSA-O
Data  1 KI
  Tab Delimited (TSV)   2D SDfile   Computed 3D by Vconf -m prep SDfile
Find this compound or compounds like it in BindingDB:
Activity Spreadsheet -- Enzyme Inhibition Constant Data from BindingDB
Found 1 hit for monomerid = 86580
TargetD(3) dopamine receptor(Homo sapiens (Human))
University Of California San Francisco
LigandPNGBDBM86580(ZINC 48057418, 45)
Affinity DataKi:  7.21E+3nM ΔG°:  -6.94kcal/molepH: 7.4 T: 2°C. Assay description: Affinities for D3-dopaminergic, D2-dopaminergic and beta2-adrenergic receptors were determined by radioligand competition binding at the National Ins...
In DepthDetails ArticlePubMed