BDBM86785 Benzonitrile analogue, 5e
SMILES Brc1ccc(Oc2ccc(cc2)C#N)cc1
InChI Key InChIKey=RXRIGCPVWWYVQV-UHFFFAOYSA-N
Data  2 IC50
  Tab Delimited (TSV)   2D SDfile   Computed 3D by Vconf -m prep SDfile
Find this compound or compounds like it in BindingDB:
Activity Spreadsheet -- Enzyme Inhibition Constant Data from BindingDB
Found 2 hits for monomerid = 86785
TargetAmine oxidase [flavin-containing] B(Homo sapiens (Human))
North-West University
LigandPNGBDBM86785(Benzonitrile analogue, 5e)
Affinity DataIC50:  266nMpH: 7.4 T: 2°C. Assay description: MAO inhibition potencies of phthalonitrile, benzonitrile and benzyl phenyl ether analogs, recombinant human MAO-A and -B were employed as enzyme sour...
In DepthDetails ArticlePubMed
TargetAmine oxidase [flavin-containing] A(Homo sapiens (Human))
North-West University
LigandPNGBDBM86785(Benzonitrile analogue, 5e)
Affinity DataIC50:  2.44E+3nMpH: 7.4 T: 2°C. Assay description: MAO inhibition potencies of phthalonitrile, benzonitrile and benzyl phenyl ether analogs, recombinant human MAO-A and -B were employed as enzyme sour...
In DepthDetails ArticlePubMed