BDBM86792 Benzyl phenyl ether analogue, 6d
SMILES Brc1ccc(CCOc2ccccc2)cc1
InChI Key InChIKey=NTFRJPBLOCKZDQ-UHFFFAOYSA-N
Data  2 IC50
  Tab Delimited (TSV)   2D SDfile   Computed 3D by Vconf -m prep SDfile
Find this compound or compounds like it in BindingDB:
Activity Spreadsheet -- Enzyme Inhibition Constant Data from BindingDB
Found 2 hits for monomerid = 86792
TargetAmine oxidase [flavin-containing] B(Homo sapiens (Human))
North-West University
LigandPNGBDBM86792(Benzyl phenyl ether analogue, 6d)
Affinity DataIC50:  1.18E+4nMpH: 7.4 T: 2°C. Assay description: MAO inhibition potencies of phthalonitrile, benzonitrile and benzyl phenyl ether analogs, recombinant human MAO-A and -B were employed as enzyme sour...
In DepthDetails ArticlePubMed
TargetAmine oxidase [flavin-containing] A(Homo sapiens (Human))
North-West University
LigandPNGBDBM86792(Benzyl phenyl ether analogue, 6d)
Affinity DataIC50:  1.02E+5nMpH: 7.4 T: 2°C. Assay description: MAO inhibition potencies of phthalonitrile, benzonitrile and benzyl phenyl ether analogs, recombinant human MAO-A and -B were employed as enzyme sour...
In DepthDetails ArticlePubMed