BDBM86811 3-(4-chlorophenyl)deschloroepibatidine::CAS_44452126::NSC_44452126
SMILES Clc1ccc(cc1)-c1cncc(c1)C1CC2CCC1N2
InChI Key InChIKey=PBZKITRBPZIVFA-UHFFFAOYSA-N
Data  1 KI
  Tab Delimited (TSV)   2D SDfile   Computed 3D by Vconf -m prep SDfile
Find this compound or compounds like it in BindingDB:
Activity Spreadsheet -- Enzyme Inhibition Constant Data from BindingDB
Found 1 hit for monomerid = 86811
TargetNeuronal acetylcholine receptor subunit alpha-4(Rattus norvegicus (Rat))
Research Triangle Institute
Curated by PDSP Ki Database
LigandPNGBDBM86811(3-(4-chlorophenyl)deschloroepibatidine | CAS_44452...)
Affinity DataKi:  0.210nM
In DepthDetails ArticlePubMed