BDBM86862 CAS_40833444::N-(5-(3-chlorobenzylthio)-1,3,4-thiadiazol-2-yl)-4-fluorobenzamide::NSC_40833444
SMILES Fc1ccc(cc1)C(=O)Nc1nnc(SCc2cccc(Cl)c2)s1
InChI Key InChIKey=GPICYOXDOHPDFD-UHFFFAOYSA-N
Data  2 KI
  Tab Delimited (TSV)   2D SDfile   Computed 3D by Vconf -m prep SDfile
Find this compound or compounds like it in BindingDB:
Activity Spreadsheet -- Enzyme Inhibition Constant Data from BindingDB
Found 2 hits for monomerid = 86862
TargetProto-oncogene tyrosine-protein kinase Src(Homo sapiens (Human))
Universit&Aagrov
Curated by PDSP Ki Database
LigandPNGBDBM86862(CAS_40833444 | N-(5-(3-chlorobenzylthio)-1,3,4-thi...)
Affinity DataKi:  247nM
In DepthDetails ArticlePubMed
TargetTyrosine-protein kinase ABL1(Homo sapiens (Human))
Universit&Aagrov
Curated by PDSP Ki Database
LigandPNGBDBM86862(CAS_40833444 | N-(5-(3-chlorobenzylthio)-1,3,4-thi...)
Affinity DataKi:  369nM
In DepthDetails ArticlePubMed